{"text_format":"1","workbook":"xlsx","n_sheets":6,"sheets":["施設情報","化学","尿一般","血液","参加施設2022","集計用"],"not_rendered":{"charts":0,"images":0,"macros":1,"external_links":0,"defined_names":7,"comments":3,"pivot_tables":0},"unopened":[],"bounds":{"document_bytes":16777216,"sheet_cells":100000,"rows_first":2000,"rows_last":500,"rows_between":2000,"halvings":0,"cell_chars":16384,"cell_head_chars":4096},"cells_cut":0,"cells_raw":0,"read":"whole","date_system":"1900"}

{"sheet":"施設情報","index":0,"n_rows":16,"n_cols":10,"rows_kept":16,"cut":false,"hidden":false,"merged":[[1,2,1,4],[8,0,8,1],[4,0,4,1],[3,0,3,1],[2,0,2,1],[8,2,8,8],[7,6,7,8],[6,6,6,8],[5,6,5,8],[2,2,2,4],[7,2,7,4],[6,2,6,4],[5,2,5,4]]}
["必ず「注意事項」，「コード表」をご確認下さい．"]
[null,null,{"$f":"IF(ISERROR(C4),\"施設番号誤入力です\",\"\")","v":""}]
["施設番号",null,null,null,null,"参加部門",{"$f":"IF(C3=\"\",\"\",IF(VLOOKUP(C3,参加施設2022!C:L,6,FALSE)=0,\"\",VLOOKUP(C3,参加施設2022!C:L,6,FALSE)))","v":""},{"$f":"IF(C3=\"\",\"\",IF(VLOOKUP(C3,参加施設2022!C:L,7,FALSE)=0,\"\",VLOOKUP(C3,参加施設2022!C:L,7,FALSE)))","v":""},{"$f":"IF(C3=\"\",\"\",IF(VLOOKUP(C3,参加施設2022!C:L,8,FALSE)=0,\"\",VLOOKUP(C3,参加施設2022!C:L,8,FALSE)))","v":""}]
["施設名",null,{"$f":"IF(C3=\"\",\"\",IF(VLOOKUP(C3,参加施設2022!C:L,4,FALSE)=0,\"\",VLOOKUP(C3,参加施設2022!C:L,4,FALSE)))","v":""}]
["電話番号",null,{"$f":"IF(C3=\"\",\"\",IF(VLOOKUP(C3,参加施設2022!C:L,10,FALSE)=0,\"\",VLOOKUP(C3,参加施設2022!C:L,10,FALSE)))","v":""}]
[null,"生化学",null,null,null,"職種",null,null,null,{"$f":"IF(ISERROR(IF(G3=\"\",\"\",IF(AND(NOT(G3=\"\"),C6=\"\",G6=\"\"),\"担当者・職種を入力して下さい\",IF(AND(NOT(G3=\"\"),NOT(C6=\"\"),G6=\"\"),\"職種 を入力して下さい\",IF(G3=\"\",\"\",IF(AND(NOT(G3=\"\"),C6=\"\",NOT(G6=\"\")),\"担当者 を入力して下さい\",IF(AND(NOT(G3=\"\"),NOT(C6=\"\"),NOT(G6=\"\")),\"\",\"\"))))))),\"\",IF(G3=\"\",\"\",IF(AND(NOT(G3=\"\"),C6=\"\",G6=\"\"),\"担当者・職種を入力して下さい\",IF(AND(NOT(G3=\"\"),NOT(C6=\"\"),G6=\"\"),\"職種 を入力して下さい\",IF(G3=\"\",\"\",IF(AND(NOT(G3=\"\"),C6=\"\",NOT(G6=\"\")),\"担当者 を入力して下さい\",IF(AND(NOT(G3=\"\"),NOT(C6=\"\"),NOT(G6=\"\")),\"\",\"\")))))))","v":""}]
["担当者名","尿一般",null,null,null,"職種",null,null,null,{"$f":"IF(ISERROR(IF(H3=\"\",\"\",IF(AND(NOT(H3=\"\"),C7=\"\",G7=\"\"),\"担当者・職種を入力して下さい\",IF(AND(NOT(H3=\"\"),NOT(C7=\"\"),G7=\"\"),\"職種を入力して下さい\",IF(H3=\"\",\"\",IF(AND(NOT(H3=\"\"),C7=\"\",NOT(G7=\"\")),\"担当者を入力して下さい\",IF(AND(NOT(H3=\"\"),NOT(C7=\"\"),NOT(G7=\"\")),\"\",\"\"))))))),\"\",IF(H3=\"\",\"\",IF(AND(NOT(H3=\"\"),C7=\"\",G7=\"\"),\"担当者・職種を入力して下さい\",IF(AND(NOT(H3=\"\"),NOT(C7=\"\"),G7=\"\"),\"職種を入力して下さい\",IF(H3=\"\",\"\",IF(AND(NOT(H3=\"\"),C7=\"\",NOT(G7=\"\")),\"担当者を入力して下さい\",IF(AND(NOT(H3=\"\"),NOT(C7=\"\"),NOT(G7=\"\")),\"\",\"\")))))))","v":""}]
[null,"血　 液",null,null,null,"職種",null,null,null,{"$f":"IF(ISERROR(IF(I3=\"\",\"\",IF(AND(NOT(I3=\"\"),C8=\"\",G8=\"\"),\"担当者・職種を入力して下さい\",IF(AND(NOT(I3=\"\"),NOT(C8=\"\"),G8=\"\"),\"職種を入力して下さい\",IF(I3=\"\",\"\",IF(AND(NOT(I3=\"\"),C8=\"\",NOT(G8=\"\")),\"担当者を入力して下さい\",IF(I3=\"\",\"\",IF(AND(NOT(I3=\"\"),NOT(C8=\"\"),NOT(G8=\"\")),\"\",\"\")))))))),\"\",IF(I3=\"\",\"\",IF(AND(NOT(I3=\"\"),C8=\"\",G8=\"\"),\"担当者・職種を入力して下さい\",IF(AND(NOT(I3=\"\"),NOT(C8=\"\"),G8=\"\"),\"職種を入力して下さい\",IF(I3=\"\",\"\",IF(AND(NOT(I3=\"\"),C8=\"\",NOT(G8=\"\")),\"担当者を入力して下さい\",IF(I3=\"\",\"\",IF(AND(NOT(I3=\"\"),NOT(C8=\"\"),NOT(G8=\"\")),\"\",\"\"))))))))","v":""}]
["測定日"]
["担当者および職種は必須入力です"]
["未入力の場合、結果入力されても保存できませんのでご注意願います"]
[]
[{"$f":"IF(COUNTIF(B14:F16,\"ERROR\")>0,\"ERROR\",\"\")","v":""},"←ここが「ERROR」だと保存できない"]
["生化学",{"$f":"IF(AND(NOT(G3=\"\"),AND(C6=\"\",G6=\"\"),COUNTA(化学!I7:J26)>0),\"ERROR\",\"\")","v":""},{"$f":"IF(AND(NOT(G3=\"\"),AND(NOT(C6=\"\"),G6=\"\"),COUNTA(化学!I7:J26)>0),\"ERROR\",\"\")","v":""},{"$f":"IF(AND(NOT(G3=\"\"),AND(C6=\"\",NOT(G6=\"\")),COUNTA(化学!I7:J26)>0),\"ERROR\",\"\")","v":""},{"$f":"IF(AND(NOT(G3=\"\"),AND(NOT(C6=\"\"),G6=\"\"),COUNTA(化学!I7:J26)=0),\"ERROR\",\"\")","v":""},{"$f":"IF(AND(NOT(G3=\"\"),AND(C6=\"\",NOT(G6=\"\")),COUNTA(化学!I7:J26)=0),\"ERROR\",\"\")","v":""},{"$f":"IF(OR(AND(NOT(G3=\"\"),AND(C6=\"\",G6=\"\"),COUNTA(化学!I7:J26)>0),AND(NOT(G3=\"\"),AND(NOT(C6=\"\"),G6=\"\"),COUNTA(化学!I7:J26)>0),AND(NOT(G3=\"\"),AND(C6=\"\",NOT(G6=\"\")),COUNTA(化学!I7:J26)>0),AND(NOT(G3=\"\"),AND(NOT(C6=\"\"),G6=\"\"),COUNTA(化学!I7:J26)=0),AND(NOT(G3=\"\"),AND(C6=\"\",NOT(G6=\"\")),COUNTA(化学!I7:J26)=0)),\"ERROR\",\"\")","v":""}]
["尿一般",{"$f":"IF(AND(NOT(H3=\"\"),AND(C7=\"\",G7=\"\"),COUNTA(尿一般!B7:Q7)>0),\"ERROR\",\"\")","v":""},{"$f":"IF(AND(NOT(H3=\"\"),AND(NOT(C7=\"\"),G7=\"\"),COUNTA(尿一般!B7:Q7)>0),\"ERROR\",\"\")","v":""},{"$f":"IF(AND(NOT(H3=\"\"),AND(C7=\"\",NOT(G7=\"\")),COUNTA(尿一般!B7:Q7)>0),\"ERROR\",\"\")","v":""},{"$f":"IF(AND(NOT(H3=\"\"),AND(NOT(C7=\"\"),G7=\"\"),COUNTA(尿一般!B7:Q7)=0),\"ERROR\",\"\")","v":""},{"$f":"IF(AND(NOT(H3=\"\"),AND(C7=\"\",NOT(G7=\"\")),COUNTA(尿一般!B7:Q7)=0),\"ERROR\",\"\")","v":""},{"$f":"IF(OR(AND(NOT(H3=\"\"),AND(C7=\"\",G7=\"\"),COUNTA(尿一般!B7:Q7)>0),AND(NOT(H3=\"\"),AND(NOT(C7=\"\"),G7=\"\"),COUNTA(尿一般!B7:Q7)>0),AND(NOT(H3=\"\"),AND(NOT(C7=\"\"),G7=\"\"),COUNTA(尿一般!B7:Q7)>0),AND(NOT(H3=\"\"),AND(C7=\"\",NOT(G7=\"\")),COUNTA(尿一般!B7:Q7)>0),AND(NOT(H3=\"\"),AND(C7=\"\",NOT(G7=\"\")),COUNTA(尿一般!B7:Q7)=0)),\"ERROR\",\"\")","v":""}]
["血　 液",{"$f":"IF(AND(NOT(I3=\"\"),AND(C8=\"\",G8=\"\"),COUNTA(血液!G7:H11)>0),\"ERROR\",\"\")","v":""},{"$f":"IF(AND(NOT(I3=\"\"),AND(NOT(C8=\"\"),G8=\"\"),COUNTA(血液!G7:H11)>0),\"ERROR\",\"\")","v":""},{"$f":"IF(AND(NOT(I3=\"\"),AND(C8=\"\",NOT(G8=\"\")),COUNTA(血液!G7:H11)>0),\"ERROR\",\"\")","v":""},{"$f":"IF(AND(NOT(I3=\"\"),AND(NOT(C8=\"\"),G8=\"\"),COUNTA(血液!G7:H11)=0),\"ERROR\",\"\")","v":""},{"$f":"IF(AND(NOT(I3=\"\"),AND(C8=\"\",NOT(G8=\"\")),COUNTA(血液!G7:H11)=0),\"ERROR\",\"\")","v":""},{"$f":"IF(OR(AND(NOT(I3=\"\"),AND(C8=\"\",G8=\"\"),COUNTA(血液!G7:H11)>0),AND(NOT(I3=\"\"),AND(NOT(C8=\"\"),G8=\"\"),COUNTA(血液!G7:H11)>0),AND(NOT(I3=\"\"),AND(C8=\"\",NOT(G8=\"\")),COUNTA(血液!G7:H11)>0),AND(NOT(I3=\"\"),AND(NOT(C8=\"\"),G8=\"\"),COUNTA(血液!G7:H11)=0),AND(NOT(I3=\"\"),AND(C8=\"\",NOT(G8=\"\")),COUNTA(血液!G7:H11)=0)),\"ERROR\",\"\")","v":""}]

{"sheet":"化学","index":1,"n_rows":35,"n_cols":12,"rows_kept":35,"cut":false,"hidden":false,"merged":[[29,1,29,11],[30,1,30,11],[31,1,31,11],[33,1,33,11],[34,1,34,11],[28,1,28,11],[4,0,5,0],[4,1,5,1],[4,2,5,2],[4,3,5,3],[4,4,5,4],[4,10,5,10],[4,11,5,11],[4,7,5,7],[1,2,1,3],[4,5,4,6],[4,8,4,9],[26,1,26,11],[27,0,27,11]]}
["１．生化学",null,null,"必ず「注意事項」，「コード表」をご確認下さい．"]
[]
[{"$f":"IF(施設情報!$C$3=\"\",\"\",施設情報!$C$3)","v":""}]
[{"$f":"施設情報!C4","v":""}]
[null,"項目","測定方法","機器","試薬","基準範囲",null,"JCCLS共用基準範囲","測定結果",null,"報告単位","報告桁数"]
[null,null,null,null,null,"下限","上限",null,"試料 1","試料 2"]
[1,"AST",null,null,null,null,null,null,null,null,"U/L","整数"]
[2,"ALT",null,null,null,null,null,null,null,null,"U/L","整数"]
[3,"LD",null,null,null,null,null,null,null,null,"U/L","整数"]
[4,"ALP",null,null,null,null,null,null,null,null,"U/L","整数"]
[5,"AMY",null,null,null,null,null,null,null,null,"U/L","整数"]
[6,"γ-GT",null,null,null,null,null,null,null,null,"U/L","整数"]
[7,"TB",null,null,null,null,null,null,null,null,"mg/dL","少数点以下1桁"]
[8,"TP",null,null,null,null,null,null,null,null,"g/dL","少数点以下1桁"]
[9,"BUN",null,null,null,null,null,null,null,null,"mg/dL","少数点以下1桁"]
[10,"UA",null,null,null,null,null,null,null,null,"mg/dL","少数点以下1桁"]
[11,"CRE",null,null,null,null,null,null,null,null,"mg/dL","少数点以下2桁"]
[12,"T-CH",null,null,null,null,null,null,null,null,"mg/dL","整数"]
[13,"TG",null,null,null,null,null,null,null,null,"mg/dL","整数"]
[14,"HDL-C",null,null,null,null,null,null,null,null,"mg/dL","整数"]
[15,"GLU",null,null,null,null,null,null,null,null,"mg/dL","整数"]
[16,"CRP",null,null,null,null,null,null,null,null,"mg/dL","少数点以下2桁"]
[17,"Na",null,null,null,null,null,null,null,null,"mmol/L","整数"]
[18,"K",null,null,null,null,null,null,null,null,"mmol/L","少数点以下1桁"]
[19,"CL",null,null,null,null,null,null,null,null,"mmol/L","整数"]
[20,"Ca",null,null,null,null,null,null,null,null,"mg/dL","少数点以下1桁"]
["備考"]
["ご注意　"]
[null,"測定単位，報告桁数は変更しないで下さい"]
[null,"測定を行っていない項目の欄は空白にして下さい"]
{"$rows_left_out":6}
{"sheet":"尿一般","index":2,"n_rows":12,"n_cols":17,"rows_kept":12,"cut":false,"hidden":false,"merged":[[4,8,4,10],[4,11,4,13],[4,14,4,16],[10,0,10,16],[11,1,11,16],[5,0,6,0],[7,3,7,4],[7,6,7,7],[7,9,7,10],[7,12,7,13],[7,15,7,16],[8,0,9,0],[8,1,9,16],[2,0,2,4],[3,0,3,4],[4,0,4,1],[4,2,4,4],[4,5,4,7]]}
["２．尿一般",null,null,"必ず「注意事項」，「コード表」をご確認下さい．"]
[]
[{"$f":"IF(施設情報!$C$3=\"\",\"\",施設情報!$C$3)","v":""}]
[{"$f":"施設情報!C4","v":""}]
["項目",null,"ケトン体",null,null,"ウロビリノーゲン",null,null,"潜血",null,null,"蛋白",null,null,"糖"]
["結果","測定法","試験紙","試料 3","試料 4","試験紙","試料 3","試料 4","試験紙","試料 3","試料 4","試験紙","試料 3","試料 4","試験紙","試料 3","試料 4"]
[]
["コード","1 ： 肉眼\n2 ： 機械\n3 ： 併用","1 ： ｼｰﾒﾝｽ\n2 ： ｱｰｸﾚｲ\n3 ： 栄研\n4 ： ﾛｼｭ\n5 ： 和光\n6 ： ﾃﾙﾓ\n7 ： 協和ｷﾘﾝ\n8 ： 三和化学\n9 ： 東洋ろ紙\n99 ： その他\n\n\n","1 ： 陰性\n2 ： 5mg/dL\n3 ： 20mg/dL\n4 ： 30mg/dL\n5 ： 40mg/dL\n6 ： 100ｍｇ/ｄL",null,"1 ： ｼｰﾒﾝｽ\n2 ： ｱｰｸﾚｲ\n3 ： 栄研\n4 ： ﾛｼｭ\n5 ： 和光\n6 ： ﾃﾙﾓ\n7 ： 協和ｷﾘﾝ\n8 ： 三和化学\n9 ： 東洋ろ紙\n99 ： その他\n\n\n","1 ： 0.1，1mg/dL\n2 ： 2mg/dL\n3 ： 4mg/dL\n4 ： 8mg/dL　               ",null,"1 ： ｼｰﾒﾝｽ\n2 ： ｱｰｸﾚｲ\n3 ： 栄研\n4 ： ﾛｼｭ\n5 ： 和光\n6 ： ﾃﾙﾓ\n7 ： 協和ｷﾘﾝ\n8 ： 三和化学\n9 ： 東洋ろ紙\n99 ： その他\n\n\n","1 ： 陰性\n2 ： +/-\n3 ： 1+\n4 ： 2+\n5 ： 3+",null,"1 ： ｼｰﾒﾝｽ\n2 ： ｱｰｸﾚｲ\n3 ： 栄研\n4 ： ﾛｼｭ\n5 ： 和光\n6 ： ﾃﾙﾓ\n7 ： 協和ｷﾘﾝ\n8 ： 三和化学\n9 ： 東洋ろ紙\n99 ： その他\n\n\n","1 ： 陰性\n2 ： +/-\n3 ： 30mg/dL\n4 ： 100mg/dL\n5 ： 300ｍｇ/ｄL\n6 ： 1000mg/dL",null,"1 ： ｼｰﾒﾝｽ\n2 ： ｱｰｸﾚｲ\n3 ： 栄研\n4 ： ﾛｼｭ\n5 ： 和光\n6 ： ﾃﾙﾓ\n7 ： 協和ｷﾘﾝ\n8 ： 三和化学\n9 ： 東洋ろ紙\n99 ： その他\n\n\n","1 ： 陰性\n2 ： 50mg/dL\n3 ： 100mg/dL\n4 ： 250mg/dL\n5 ： 500ｍｇ/ｄL\n6 ： 1000mg/dL"]
["備考"]
[]
["ご注意"]
[null,"測定を行っていない項目の欄は空白にしてください"]

{"sheet":"血液","index":3,"n_rows":16,"n_cols":10,"rows_kept":16,"cut":false,"hidden":false,"merged":[[15,1,15,9],[4,0,5,0],[4,1,5,1],[4,2,5,2],[4,8,5,8],[4,9,5,9],[4,3,4,4],[4,6,4,7],[11,1,11,9],[12,0,12,9],[13,1,13,9],[1,2,1,3],[14,1,14,9],[4,5,5,5],[3,0,3,3],[2,0,2,3]]}
["３．血液",null,null,"必ず「注意事項」，「コード表」をご確認下さい．"]
[]
[{"$f":"IF(施設情報!$C$3=\"\",\"\",施設情報!$C$3)","v":""}]
[{"$f":"施設情報!C4","v":""}]
[null,"項目","機器","基準範囲",null,"JCCLS共用基準範囲","測定結果",null,"報告単位","報告桁数"]
[null,null,null,"下限","上限",null,"試料 5","試料 6"]
[1,"Hb",null,null,null,null,null,null,"g/dL","少数点以下1桁"]
[2,"Hｔ",null,null,null,null,null,null,"％","少数点以下1桁"]
[3,"RBC",null,null,null,null,null,null,"×104/μL","少数点以下1桁"]
[4,"WBC",null,null,null,null,null,null,"/μL","整数"]
[5,"PLT",null,null,null,null,null,null,"×104/μL","少数点以下1桁"]
["備考"]
["ご注意　"]
[null,"測定単位，報告桁数は変更しないで下さい"]
[null,"測定を行っていない項目の欄は空白にしてください"]
[null,"男女別の基準範囲がある場合，男性の基準範囲を入力してください"]

{"sheet":"参加施設2022","index":4,"n_rows":134,"n_cols":12,"rows_kept":134,"cut":false,"hidden":true,"merged":[]}
["郡市名","コード","　=ABS()","回数R3","回数R4","参加施設名","参加部門","生化学","尿一般","血液","住所","電話番号"]
["盛岡市","01101",{"$f":"ABS(B2)","v":1101},40,41,"盛岡赤十字病院","生尿血","生化学","尿一般","血液","盛岡市三本柳6地割1番地1","019-637-3111 "]
["盛岡市","01102",{"$f":"ABS(B3)","v":1102},40,41,"遠山病院","生尿血","生化学","尿一般","血液","盛岡市下ノ橋町6番14号","019-651-2111"]
["盛岡市","01103",1103,40,41,"国立病院機構　盛岡医療センター","生尿血","生化学","尿一般","血液","盛岡市青山一丁目25番1号","019-647-2195"]
["盛岡市","01104",1104,40,41,"盛岡市立病院","生尿血","生化学","尿一般","血液","盛岡市本宮五丁目15番1号","019-635-0101"]
["盛岡市","01105",1105,40,41,"岩手医科大学附属内丸メディカルセンター","生尿血","生化学","尿一般","血液","盛岡市内丸19番1号","019-613-6111"]
["盛岡市","01106",1106,40,41,"岩手県立中央病院","生尿血","生化学","尿一般","血液","盛岡市上田一丁目4番1号","019-653-1151"]
["盛岡市","01108",1108,40,41,"盛岡つなぎ温泉病院","生尿血","生化学","尿一般","血液","盛岡市繋字尾入野64番地9","019-689-2101　"]
["盛岡市","01110",1110,39,40,"盛岡観山荘病院","生尿血","生化学","尿一般","血液","盛岡市高松四丁目20番40号","019-661-2685"]
["盛岡市","01111",1111,40,null,"三田記念病院",null,null,null,null,"盛岡市加賀野三丁目14番1号","019-624-3251"]
["盛岡市","01112",1112,40,41,"三愛病院","生尿血","生化学","尿一般","血液","盛岡市月が丘一丁目29番15号","019-641-6633"]
["盛岡市","01113",1113,35,36,"孝仁病院","生尿血","生化学","尿一般","血液","盛岡市中太田泉田28番地","019-656-2888"]
["盛岡市","01115",1115,36,37,"内丸病院","生尿血","生化学","尿一般","血液","盛岡市本町通一丁目12番7号","019-654-5331"]
["盛岡市","01135",1135,39,40,"栃内病院","生尿血","生化学","尿一般","血液","盛岡市肴町2番28号","019-623-1316"]
["盛岡市","01140",1140,31,32,"高松病院","生尿血","生化学","尿一般","血液","盛岡市館向町4番8号","019-624-2250"]
["盛岡市","01149",1149,31,32,"松園第二病院","生尿血","生化学","尿一般","血液","盛岡市西松園三丁目22番3号","019-601-6113"]
["盛岡市","01151",1151,38,39,"都南病院","生尿血","生化学","尿一般","血液","盛岡市東見前6地割40番地1","019-638-7311"]
["盛岡市","01153",1153,40,41,"盛岡南病院","　尿血",null,"尿一般","血液","盛岡市津志田13地割18番地4","019-638-2020"]
["盛岡市","01155",1155,20,21,"盛岡友愛病院","生尿血","生化学","尿一般","血液","盛岡市永井12地割10番地","019-638-2222"]
["盛岡市","01156",1156,18,19,"川久保病院","生尿血","生化学","尿一般","血液","盛岡市津志田26地割30番地1","019-635-1619"]
["盛岡市","01157",1157,40,41,"渋民中央病院","　尿血",null,"尿一般","血液","盛岡市玉山区渋民字大前田53番地2","019-683-2336"]
["盛岡市","01158",1158,28,29,"八角病院","生尿血","生化学","尿一般","血液","盛岡市玉山区好摩字夏間木70番地190","019-682-0201"]
["盛岡市","01159",1159,7,8,"未来の風せいわ病院","生","生化学",null,null,"盛岡市手代森9地割70番地1","019-696-2055"]
["盛岡市","01217",1217,40,41,"株式会社中央臨床メディエンス","生尿血","生化学","尿一般","血液","盛岡市青山4-47-30","019-641-3411"]
["盛岡市","01218",1218,40,41,"盛岡臨床検査センター","生尿血","生化学","尿一般","血液","盛岡市羽場13-30-3","019-639-9218"]
["盛岡市","01255",1255,40,41,"岩手県予防医学協会","生尿血","生化学","尿一般","血液","盛岡市北飯岡四丁目8番50号","019-638-7185"]
["盛岡市","01321",1321,29,30,"西松園内科医院","　尿血",null,"尿一般","血液","盛岡市西松園三丁目22番1号","019-662-1622"]
["盛岡市","01323",1323,29,30,"鎌田内科クリニック","　尿",null,"尿一般",null,"盛岡市本宮二丁目20番1号","019-636-1725"]
["盛岡市","01333",1333,29,30,"かなざわ内科クリニック","　尿血",null,"尿一般","血液","盛岡市上堂一丁目18番24号","019-647-3057"]
["盛岡市","01338",1338,29,30,"小豆嶋胃腸科内科クリニック","生尿血","生化学","尿一般","血液","盛岡市仙北三丁目13番20号","019-636-1503"]
{"$rows_left_out":105}
{"sheet":"集計用","index":5,"n_rows":39,"n_cols":21,"rows_kept":39,"cut":false,"hidden":true,"merged":[]}
[0,{"$f":"$E$2","v":""},{"$f":"IF(施設情報!C3=\"\",\"\",施設情報!C3)","v":""},"施設番号",{"$f":"IF(施設情報!C3=\"\",\"\",施設情報!C3)","v":""}]
[0,"",{"$f":"E1","v":""},"施設名",{"$f":"IF(施設情報!C4=\"\",\"\",施設情報!C4)","v":""}]
[0,"",{"$f":"C2","v":""},"電話番号",{"$f":"IF(施設情報!C5=\"\",\"\",施設情報!C5)","v":""}]
[1,"",{"$f":"C3","v":""},"担当者名生化学",{"$f":"IF(施設情報!C6=\"\",\"\",施設情報!C6)","v":""},"職種生化学",{"$f":"IF(施設情報!G6=\"\",\"\",施設情報!G6)","v":""},{"$f":"IF(施設情報!J6=\"\",\"\",施設情報!J6)","v":""}]
[2,"",{"$f":"C4","v":""},"担当者名尿一般",{"$f":"IF(施設情報!C7=\"\",\"\",施設情報!C7)","v":""},"職種尿一般",{"$f":"IF(施設情報!G7=\"\",\"\",施設情報!G7)","v":""},{"$f":"IF(施設情報!J7=\"\",\"\",施設情報!J7)","v":""}]
[3,"",{"$f":"C5","v":""},"担当者名血液",{"$f":"IF(施設情報!C8=\"\",\"\",施設情報!C8)","v":""},"職種名血液",{"$f":"IF(施設情報!G8=\"\",\"\",施設情報!G8)","v":""},{"$f":"IF(施設情報!J8=\"\",\"\",施設情報!J8)","v":""}]
[0,"",{"$f":"C6","v":""},"測定日時",{"$f":"IF(施設情報!C9=\"\",\"\",施設情報!C9)","v":""}]
[1,null,null,null,{"$f":"化学!B5","v":"項目"},{"$f":"化学!C5","v":"測定方法"},{"$f":"化学!D5","v":"機器"},{"$f":"化学!E5","v":"試薬"},{"$f":"化学!F6","v":"下限"},{"$f":"化学!G6","v":"上限"},{"$f":"化学!I6","v":"試料 1"},{"$f":"化学!J6","v":"試料 2"},"JCCLS共用基準範囲"]
[1,{"$f":"$E$2","v":""},{"$f":"化学!A3","v":""},{"$f":"化学!A7","v":1},{"$f":"化学!B7","v":"AST"},{"$f":"IF(化学!C7=\"\",\"\",化学!C7)","v":""},{"$f":"IF(化学!D7=\"\",\"\",化学!D7)","v":""},{"$f":"IF(化学!E7=\"\",\"\",化学!E7)","v":""},{"$f":"IF(化学!F7=\"\",\"\",ROUND(化学!F7,0))","v":""},{"$f":"IF(化学!G7=\"\",\"\",ROUND(化学!G7,0))","v":""},{"$f":"IF(化学!I7=\"\",\"\",ROUND(化学!I7,0))","v":""},{"$f":"IF(化学!J7=\"\",\"\",ROUND(化学!J7,0))","v":""},{"$f":"IF(化学!H7=\"\",\"\",化学!H7)","v":""},"U/L","整数"]
[1,"",{"$f":"C9","v":""},{"$f":"化学!A8","v":2},{"$f":"化学!B8","v":"ALT"},{"$f":"IF(化学!C8=\"\",\"\",化学!C8)","v":""},{"$f":"IF(化学!D8=\"\",\"\",化学!D8)","v":""},{"$f":"IF(化学!E8=\"\",\"\",化学!E8)","v":""},{"$f":"IF(化学!F8=\"\",\"\",ROUND(化学!F8,0))","v":""},{"$f":"IF(化学!G8=\"\",\"\",ROUND(化学!G8,0))","v":""},{"$f":"IF(化学!I8=\"\",\"\",ROUND(化学!I8,0))","v":""},{"$f":"IF(化学!J8=\"\",\"\",ROUND(化学!J8,0))","v":""},{"$f":"IF(化学!H8=\"\",\"\",化学!H8)","v":""},"U/L","整数"]
[1,"","",{"$f":"化学!A9","v":3},{"$f":"化学!B9","v":"LD"},{"$f":"IF(化学!C9=\"\",\"\",化学!C9)","v":""},{"$f":"IF(化学!D9=\"\",\"\",化学!D9)","v":""},{"$f":"IF(化学!E9=\"\",\"\",化学!E9)","v":""},{"$f":"IF(化学!F9=\"\",\"\",ROUND(化学!F9,0))","v":""},{"$f":"IF(化学!G9=\"\",\"\",ROUND(化学!G9,0))","v":""},{"$f":"IF(化学!I9=\"\",\"\",ROUND(化学!I9,0))","v":""},{"$f":"IF(化学!J9=\"\",\"\",ROUND(化学!J9,0))","v":""},{"$f":"IF(化学!H9=\"\",\"\",化学!H9)","v":""},"U/L","整数"]
[1,"","",{"$f":"化学!A10","v":4},{"$f":"化学!B10","v":"ALP"},{"$f":"IF(化学!C10=\"\",\"\",化学!C10)","v":""},{"$f":"IF(化学!D10=\"\",\"\",化学!D10)","v":""},{"$f":"IF(化学!E10=\"\",\"\",化学!E10)","v":""},{"$f":"IF(化学!F10=\"\",\"\",ROUND(化学!F10,0))","v":""},{"$f":"IF(化学!G10=\"\",\"\",ROUND(化学!G10,0))","v":""},{"$f":"IF(化学!I10=\"\",\"\",ROUND(化学!I10,0))","v":""},{"$f":"IF(化学!J10=\"\",\"\",ROUND(化学!J10,0))","v":""},{"$f":"IF(化学!H10=\"\",\"\",化学!H10)","v":""},"U/L","整数"]
[1,"","",{"$f":"化学!A11","v":5},{"$f":"化学!B11","v":"AMY"},{"$f":"IF(化学!C11=\"\",\"\",化学!C11)","v":""},{"$f":"IF(化学!D11=\"\",\"\",化学!D11)","v":""},{"$f":"IF(化学!E11=\"\",\"\",化学!E11)","v":""},{"$f":"IF(化学!F11=\"\",\"\",ROUND(化学!F11,0))","v":""},{"$f":"IF(化学!G11=\"\",\"\",ROUND(化学!G11,0))","v":""},{"$f":"IF(化学!I11=\"\",\"\",ROUND(化学!I11,0))","v":""},{"$f":"IF(化学!J11=\"\",\"\",ROUND(化学!J11,0))","v":""},{"$f":"IF(化学!H11=\"\",\"\",化学!H11)","v":""},"U/L","整数"]
[1,"","",{"$f":"化学!A12","v":6},{"$f":"化学!B12","v":"γ-GT"},{"$f":"IF(化学!C12=\"\",\"\",化学!C12)","v":""},{"$f":"IF(化学!D12=\"\",\"\",化学!D12)","v":""},{"$f":"IF(化学!E12=\"\",\"\",化学!E12)","v":""},{"$f":"IF(化学!F12=\"\",\"\",ROUND(化学!F12,0))","v":""},{"$f":"IF(化学!G12=\"\",\"\",ROUND(化学!G12,0))","v":""},{"$f":"IF(化学!I12=\"\",\"\",ROUND(化学!I12,0))","v":""},{"$f":"IF(化学!J12=\"\",\"\",ROUND(化学!J12,0))","v":""},{"$f":"IF(化学!H12=\"\",\"\",化学!H12)","v":""},"U/L","整数"]
[1,"","",{"$f":"化学!A13","v":7},{"$f":"化学!B13","v":"TB"},{"$f":"IF(化学!C13=\"\",\"\",化学!C13)","v":""},{"$f":"IF(化学!D13=\"\",\"\",化学!D13)","v":""},{"$f":"IF(化学!E13=\"\",\"\",化学!E13)","v":""},{"$f":"IF(化学!F13=\"\",\"\",ROUND(化学!F13,1))","v":""},{"$f":"IF(化学!G13=\"\",\"\",ROUND(化学!G13,1))","v":""},{"$f":"IF(化学!I13=\"\",\"\",ROUND(化学!I13,1))","v":""},{"$f":"IF(化学!J13=\"\",\"\",ROUND(化学!J13,1))","v":""},{"$f":"IF(化学!H13=\"\",\"\",化学!H13)","v":""},"mg/dL","少数点以下1桁"]
[1,"","",{"$f":"化学!A14","v":8},{"$f":"化学!B14","v":"TP"},{"$f":"IF(化学!C14=\"\",\"\",化学!C14)","v":""},{"$f":"IF(化学!D14=\"\",\"\",化学!D14)","v":""},{"$f":"IF(化学!E14=\"\",\"\",化学!E14)","v":""},{"$f":"IF(化学!F14=\"\",\"\",ROUND(化学!F14,1))","v":""},{"$f":"IF(化学!G14=\"\",\"\",ROUND(化学!G14,1))","v":""},{"$f":"IF(化学!I14=\"\",\"\",ROUND(化学!I14,1))","v":""},{"$f":"IF(化学!J14=\"\",\"\",ROUND(化学!J14,1))","v":""},{"$f":"IF(化学!H14=\"\",\"\",化学!H14)","v":""},"g/dL","少数点以下1桁"]
[1,"","",{"$f":"化学!A15","v":9},{"$f":"化学!B15","v":"BUN"},{"$f":"IF(化学!C15=\"\",\"\",化学!C15)","v":""},{"$f":"IF(化学!D15=\"\",\"\",化学!D15)","v":""},{"$f":"IF(化学!E15=\"\",\"\",化学!E15)","v":""},{"$f":"IF(化学!F15=\"\",\"\",ROUND(化学!F15,1))","v":""},{"$f":"IF(化学!G15=\"\",\"\",ROUND(化学!G15,1))","v":""},{"$f":"IF(化学!I15=\"\",\"\",ROUND(化学!I15,1))","v":""},{"$f":"IF(化学!J15=\"\",\"\",ROUND(化学!J15,1))","v":""},{"$f":"IF(化学!H15=\"\",\"\",化学!H15)","v":""},"mg/dL","少数点以下1桁"]
[1,"","",{"$f":"化学!A16","v":10},{"$f":"化学!B16","v":"UA"},{"$f":"IF(化学!C16=\"\",\"\",化学!C16)","v":""},{"$f":"IF(化学!D16=\"\",\"\",化学!D16)","v":""},{"$f":"IF(化学!E16=\"\",\"\",化学!E16)","v":""},{"$f":"IF(化学!F16=\"\",\"\",ROUND(化学!F16,1))","v":""},{"$f":"IF(化学!G16=\"\",\"\",ROUND(化学!G16,1))","v":""},{"$f":"IF(化学!I16=\"\",\"\",ROUND(化学!I16,1))","v":""},{"$f":"IF(化学!J16=\"\",\"\",ROUND(化学!J16,1))","v":""},{"$f":"IF(化学!H16=\"\",\"\",化学!H16)","v":""},"mg/dL","少数点以下1桁"]
[1,"","",{"$f":"化学!A17","v":11},{"$f":"化学!B17","v":"CRE"},{"$f":"IF(化学!C17=\"\",\"\",化学!C17)","v":""},{"$f":"IF(化学!D17=\"\",\"\",化学!D17)","v":""},{"$f":"IF(化学!E17=\"\",\"\",化学!E17)","v":""},{"$f":"IF(化学!F17=\"\",\"\",ROUND(化学!F17,2))","v":""},{"$f":"IF(化学!G17=\"\",\"\",ROUND(化学!G17,2))","v":""},{"$f":"IF(化学!I17=\"\",\"\",ROUND(化学!I17,2))","v":""},{"$f":"IF(化学!J17=\"\",\"\",ROUND(化学!J17,2))","v":""},{"$f":"IF(化学!H17=\"\",\"\",化学!H17)","v":""},"mg/dL","少数点以下2桁"]
[1,"","",{"$f":"化学!A18","v":12},{"$f":"化学!B18","v":"T-CH"},{"$f":"IF(化学!C18=\"\",\"\",化学!C18)","v":""},{"$f":"IF(化学!D18=\"\",\"\",化学!D18)","v":""},{"$f":"IF(化学!E18=\"\",\"\",化学!E18)","v":""},{"$f":"IF(化学!F18=\"\",\"\",ROUND(化学!F18,0))","v":""},{"$f":"IF(化学!G18=\"\",\"\",ROUND(化学!G18,0))","v":""},{"$f":"IF(化学!I18=\"\",\"\",ROUND(化学!I18,0))","v":""},{"$f":"IF(化学!J18=\"\",\"\",ROUND(化学!J18,0))","v":""},{"$f":"IF(化学!H18=\"\",\"\",化学!H18)","v":""},"mg/dL","整数"]
[1,"","",{"$f":"化学!A19","v":13},{"$f":"化学!B19","v":"TG"},{"$f":"IF(化学!C19=\"\",\"\",化学!C19)","v":""},{"$f":"IF(化学!D19=\"\",\"\",化学!D19)","v":""},{"$f":"IF(化学!E19=\"\",\"\",化学!E19)","v":""},{"$f":"IF(化学!F19=\"\",\"\",ROUND(化学!F19,0))","v":""},{"$f":"IF(化学!G19=\"\",\"\",ROUND(化学!G19,0))","v":""},{"$f":"IF(化学!I19=\"\",\"\",ROUND(化学!I19,0))","v":""},{"$f":"IF(化学!J19=\"\",\"\",ROUND(化学!J19,0))","v":""},{"$f":"IF(化学!H19=\"\",\"\",化学!H19)","v":""},"mg/dL","整数"]
[1,"","",{"$f":"化学!A20","v":14},{"$f":"化学!B20","v":"HDL-C"},{"$f":"IF(化学!C20=\"\",\"\",化学!C20)","v":""},{"$f":"IF(化学!D20=\"\",\"\",化学!D20)","v":""},{"$f":"IF(化学!E20=\"\",\"\",化学!E20)","v":""},{"$f":"IF(化学!F20=\"\",\"\",ROUND(化学!F20,0))","v":""},{"$f":"IF(化学!G20=\"\",\"\",ROUND(化学!G20,0))","v":""},{"$f":"IF(化学!I20=\"\",\"\",ROUND(化学!I20,0))","v":""},{"$f":"IF(化学!J20=\"\",\"\",ROUND(化学!J20,0))","v":""},{"$f":"IF(化学!H20=\"\",\"\",化学!H20)","v":""},"mg/dL","整数"]
[1,"","",{"$f":"化学!A21","v":15},{"$f":"化学!B21","v":"GLU"},{"$f":"IF(化学!C21=\"\",\"\",化学!C21)","v":""},{"$f":"IF(化学!D21=\"\",\"\",化学!D21)","v":""},{"$f":"IF(化学!E21=\"\",\"\",化学!E21)","v":""},{"$f":"IF(化学!F21=\"\",\"\",ROUND(化学!F21,0))","v":""},{"$f":"IF(化学!G21=\"\",\"\",ROUND(化学!G21,0))","v":""},{"$f":"IF(化学!I21=\"\",\"\",ROUND(化学!I21,0))","v":""},{"$f":"IF(化学!J21=\"\",\"\",ROUND(化学!J21,0))","v":""},{"$f":"IF(化学!H21=\"\",\"\",化学!H21)","v":""},"mg/dL","整数"]
[1,"","",{"$f":"化学!A22","v":16},{"$f":"化学!B22","v":"CRP"},{"$f":"IF(化学!C22=\"\",\"\",化学!C22)","v":""},{"$f":"IF(化学!D22=\"\",\"\",化学!D22)","v":""},{"$f":"IF(化学!E22=\"\",\"\",化学!E22)","v":""},{"$f":"IF(化学!F22=\"\",\"\",ROUND(化学!F22,2))","v":""},{"$f":"IF(化学!G22=\"\",\"\",ROUND(化学!G22,2))","v":""},{"$f":"IF(化学!I22=\"\",\"\",ROUND(化学!I22,2))","v":""},{"$f":"IF(化学!J22=\"\",\"\",ROUND(化学!J22,2))","v":""},{"$f":"IF(化学!H22=\"\",\"\",化学!H22)","v":""},"mg/dL","少数点以下2桁"]
[1,"","",{"$f":"化学!A23","v":17},{"$f":"化学!B23","v":"Na"},{"$f":"IF(化学!C23=\"\",\"\",化学!C23)","v":""},{"$f":"IF(化学!D23=\"\",\"\",化学!D23)","v":""},{"$f":"IF(化学!E23=\"\",\"\",化学!E23)","v":""},{"$f":"IF(化学!F23=\"\",\"\",ROUND(化学!F23,0))","v":""},{"$f":"IF(化学!G23=\"\",\"\",ROUND(化学!G23,0))","v":""},{"$f":"IF(化学!I23=\"\",\"\",ROUND(化学!I23,0))","v":""},{"$f":"IF(化学!J23=\"\",\"\",ROUND(化学!J23,0))","v":""},{"$f":"IF(化学!H23=\"\",\"\",化学!H23)","v":""},"mmol/L","整数"]
[1,"","",{"$f":"化学!A24","v":18},{"$f":"化学!B24","v":"K"},{"$f":"IF(化学!C24=\"\",\"\",化学!C24)","v":""},{"$f":"IF(化学!D24=\"\",\"\",化学!D24)","v":""},{"$f":"IF(化学!E24=\"\",\"\",化学!E24)","v":""},{"$f":"IF(化学!F24=\"\",\"\",ROUND(化学!F24,1))","v":""},{"$f":"IF(化学!G24=\"\",\"\",ROUND(化学!G24,1))","v":""},{"$f":"IF(化学!I24=\"\",\"\",ROUND(化学!I24,1))","v":""},{"$f":"IF(化学!J24=\"\",\"\",ROUND(化学!J24,1))","v":""},{"$f":"IF(化学!H24=\"\",\"\",化学!H24)","v":""},"mmol/L","少数点以下1桁"]
[1,"","",{"$f":"化学!A25","v":19},{"$f":"化学!B25","v":"CL"},{"$f":"IF(化学!C25=\"\",\"\",化学!C25)","v":""},{"$f":"IF(化学!D25=\"\",\"\",化学!D25)","v":""},{"$f":"IF(化学!E25=\"\",\"\",化学!E25)","v":""},{"$f":"IF(化学!F25=\"\",\"\",ROUND(化学!F25,0))","v":""},{"$f":"IF(化学!G25=\"\",\"\",ROUND(化学!G25,0))","v":""},{"$f":"IF(化学!I25=\"\",\"\",ROUND(化学!I25,0))","v":""},{"$f":"IF(化学!J25=\"\",\"\",ROUND(化学!J25,0))","v":""},{"$f":"IF(化学!H25=\"\",\"\",化学!H25)","v":""},"mmol/L","整数"]
[1,"","",{"$f":"化学!A26","v":20},{"$f":"化学!B26","v":"Ca"},{"$f":"IF(化学!C26=\"\",\"\",化学!C26)","v":""},{"$f":"IF(化学!D26=\"\",\"\",化学!D26)","v":""},{"$f":"IF(化学!E26=\"\",\"\",化学!E26)","v":""},{"$f":"IF(化学!F26=\"\",\"\",ROUND(化学!F26,1))","v":""},{"$f":"IF(化学!G26=\"\",\"\",ROUND(化学!G26,1))","v":""},{"$f":"IF(化学!I26=\"\",\"\",ROUND(化学!I26,1))","v":""},{"$f":"IF(化学!J26=\"\",\"\",ROUND(化学!J26,1))","v":""},{"$f":"IF(化学!H26=\"\",\"\",化学!H26)","v":""},"mg/dL","少数点以下1桁"]
[1,"","",{"$f":"化学!A27","v":"備考"},{"$f":"IF(化学!B27=\"\",\"\",化学!B27)","v":""}]
[2,null,null,null,null,"ケトン体",null,null,"ウロビリノーゲン",null,null,"潜血",null,"潜血","蛋白",null,null,"糖",null,null,"備考"]
{"$rows_left_out":9}